Attività di agenti e mediatori di assicurazioni
type: PrivateOrgActivityType
broader: https://w3id.org/italia/controlled-vocabulary/classifications-for-organizations/ateco-2007/662
notation: 66.22
has rank order: 4
narrower: https://w3id.org/italia/controlled-vocabulary/classifications-for-organizations/ateco-2007/66220
definition: Questa classe include le attività di agenti e mediatori (intermediari delle assicurazioni) nella vendita, nella negoziazione o nella sollecitazione di rendite vitalizie e di polizze di assicurazione e riassicurazione.
in scheme: ateco-2007
type: Concept