Attività di agenti e mediatori di assicurazioni
type: PrivateOrgActivityType
type: Concept
broader: 662
definition: Questa classe include le attività di agenti e mediatori (intermediari delle assicurazioni) nella vendita, nella negoziazione o nella sollecitazione di rendite vitalizie e di polizze di assicurazione e riassicurazione.
in scheme: ateco-2007
narrower: 66220
notation: 66.22
has rank order: 4