ATTIVITÀ AUSILIARIE DELLE ASSICURAZIONI E DEI FONDI PENSIONE
type: Concept
narrower: https://w3id.org/italia/controlled-vocabulary/classifications-for-organizations/ateco-2007/6621
definition: Questo gruppo include le attività di coloro che agiscono in qualità di agenti (ovvero mediatori) nella vendita di rendite vitalizie e polizze assicurative o nell'erogazione di altri benefici o servizi relativi alle assicurazioni e ai fondi pensione, come la liquidazione degli indennizzi e l'attività di gestione delle polizze assicurative di una impresa o di un gruppo di imprese da parte di soggetti diversi dalla società di assicurazione e dall'assicurato.
narrower: https://w3id.org/italia/controlled-vocabulary/classifications-for-organizations/ateco-2007/6629
narrower: https://w3id.org/italia/controlled-vocabulary/classifications-for-organizations/ateco-2007/6622
has rank order: 3
broader: https://w3id.org/italia/controlled-vocabulary/classifications-for-organizations/ateco-2007/66
type: PrivateOrgActivityType
notation: 66.2
in scheme: ateco-2007