Attività di gestione dei fondi
type: PrivateOrgActivityType
broader: https://w3id.org/italia/controlled-vocabulary/classifications-for-organizations/ateco-2007/663
notation: 66.30
has rank order: 4
narrower: https://w3id.org/italia/controlled-vocabulary/classifications-for-organizations/ateco-2007/66300
definition: Questa classe include l'attività di gestione di portafogli e fondi a fronte di un contratto o del pagamento di una commissione, per conto di privati, imprese o altri soggetti.
in scheme: ateco-2007
type: Concept