Attività di gestione dei fondi
type: PrivateOrgActivityType
type: Concept
broader: 663
definition: Questa classe include l'attività di gestione di portafogli e fondi a fronte di un contratto o del pagamento di una commissione, per conto di privati, imprese o altri soggetti.
in scheme: ateco-2007
narrower: 66300
notation: 66.30
has rank order: 4