ATTIVITÀ DEGLI STUDI DI ARCHITETTURA, INGEGNERIA ED ALTRI STUDI TECNICI
type: PrivateOrgActivityType
narrower: https://w3id.org/italia/controlled-vocabulary/classifications-for-organizations/ateco-2007/7112
narrower: https://w3id.org/italia/controlled-vocabulary/classifications-for-organizations/ateco-2007/7111
notation: 71.1
has rank order: 3
broader: https://w3id.org/italia/controlled-vocabulary/classifications-for-organizations/ateco-2007/71
type: Concept
in scheme: ateco-2007
definition: Questo gruppo include le attività degli studi di architettura ed ingegneria, i servizi di stesura di progetti, di ispezione edile, le attività di indagine e di mappatura e simili.