ATTIVITÀ DEGLI STUDI DI ARCHITETTURA E D'INGEGNERIA; COLLAUDI ED ANALISI TECNICHE
type: Concept
type: PrivateOrgActivityType
narrower: https://w3id.org/italia/controlled-vocabulary/classifications-for-organizations/ateco-2007/711
narrower: https://w3id.org/italia/controlled-vocabulary/classifications-for-organizations/ateco-2007/712
in scheme: ateco-2007
definition: Questa divisione comprende le attività degli studi di architettura, ingegneria, di stesura di progetti, di ispezione edile e le attività di indagine e di mappatura. Sono incluse anche le attività relative ai collaudi fisici, chimici o di altro tipo.
notation: 71
broader: https://w3id.org/italia/controlled-vocabulary/classifications-for-organizations/ateco-2007/M
has rank order: 2