PUBBLICITÀ E RICERCHE DI MERCATO
type: Concept
type: PrivateOrgActivityType
narrower: https://w3id.org/italia/controlled-vocabulary/classifications-for-organizations/ateco-2007/732
narrower: https://w3id.org/italia/controlled-vocabulary/classifications-for-organizations/ateco-2007/731
notation: 73
has rank order: 2
definition: Questa divisione include l'ideazione di campagne pubblicitarie e la locazione di tali pubblicità in periodici, giornali, stazioni radiotelevisive o altri mezzi di informazione, nonchà© il design di strutture e spazi espositivi.
broader: https://w3id.org/italia/controlled-vocabulary/classifications-for-organizations/ateco-2007/M
in scheme: ateco-2007