Altre attività professionali, scientifiche e tecniche n.c.a.
type: PrivateOrgActivityType
has rank order: 4
in scheme: ateco-2007
narrower: https://w3id.org/italia/controlled-vocabulary/classifications-for-organizations/ateco-2007/74909
notation: 74.90
narrower: https://w3id.org/italia/controlled-vocabulary/classifications-for-organizations/ateco-2007/74901
broader: https://w3id.org/italia/controlled-vocabulary/classifications-for-organizations/ateco-2007/749
narrower: https://w3id.org/italia/controlled-vocabulary/classifications-for-organizations/ateco-2007/74902
type: Concept
definition: Questa classe include diverse attività di servizi rivolte principalmente a clienti commerciali. Sono incluse attività per le quali sono richiesti elevati livelli di preparazione professionale, scientifica e tecnica. Da questa classe sono escluse le attività svolte da parte degli studi di architettura e di ingegneria, dei commercialisti, avvocati, notai eccetera, consulenza gestionale eccetera.