ALTRE ATTIVITÀ PROFESSIONALI, SCIENTIFICHE E TECNICHE
type: Concept
narrower: https://w3id.org/italia/controlled-vocabulary/classifications-for-organizations/ateco-2007/742
notation: 74
broader: https://w3id.org/italia/controlled-vocabulary/classifications-for-organizations/ateco-2007/M
definition: Questa divisione include l'erogazione di servizi professionali, scientifici e tecnici (escluse le attività legali e di contabilità ; le attività degli studi di architettura e ingegneria; i collaudi e le analisi tecniche; le attività di gestione e consulenza aziendale; le attività di ricerca e sviluppo e le attività delle agenzie pubblicitarie).
narrower: https://w3id.org/italia/controlled-vocabulary/classifications-for-organizations/ateco-2007/743
narrower: https://w3id.org/italia/controlled-vocabulary/classifications-for-organizations/ateco-2007/741
type: PrivateOrgActivityType
has rank order: 2
narrower: https://w3id.org/italia/controlled-vocabulary/classifications-for-organizations/ateco-2007/749
in scheme: ateco-2007