Attività delle agenzie di lavoro temporaneo (interinale)
type: PrivateOrgActivityType
type: Concept
broader: 782
definition: Questa classe include le attività di fornitura di personale a imprese clienti per un periodo limitato di tempo a rimpiazzo o supporto temporaneo di forza lavoro del cliente, dove il personale fornito à¨ dipendente dall'agenzia interinale. Tuttavia, qui non à¨ classificata l'attività di supervisione diretta dei propri impiegati presso le sedi delle imprese clienti.
in scheme: ateco-2007
narrower: 78200
notation: 78.20
has rank order: 4