ATTIVITÀ DELLE AGENZIE DI VIAGGIO E DEI TOUR OPERATOR
type: PrivateOrgActivityType
type: Concept
narrower: https://w3id.org/italia/controlled-vocabulary/classifications-for-organizations/ateco-2007/7912
narrower: https://w3id.org/italia/controlled-vocabulary/classifications-for-organizations/ateco-2007/7911
has rank order: 3
broader: https://w3id.org/italia/controlled-vocabulary/classifications-for-organizations/ateco-2007/79
in scheme: ateco-2007
notation: 79.1
definition: Questo gruppo include le attività delle agenzie principalmente impegnate nella vendita di pacchetti di viaggio, gite, servizi di trasporto e sistemazione per il pubblico e per clienti commerciali, le attività di organizzazione e gestione di gite turistiche proposte da agenzie di viaggio o tour operator.