ATTIVITÀ DELLE AGENZIE DI VIAGGIO E DEI TOUR OPERATOR
type: PrivateOrgActivityType
type: Concept
broader: 79
definition: Questo gruppo include le attività delle agenzie principalmente impegnate nella vendita di pacchetti di viaggio, gite, servizi di trasporto e sistemazione per il pubblico e per clienti commerciali, le attività di organizzazione e gestione di gite turistiche proposte da agenzie di viaggio o tour operator.
in scheme: ateco-2007
narrower: 7912
narrower: 7911
notation: 79.1
has rank order: 3