ATTIVITÀ DEI SERVIZI DELLE AGENZIE DI VIAGGIO, DEI TOUR OPERATOR E SERVIZI DI PRENOTAZIONE E ATTIVITÀ CONNESSE
type: PrivateOrgActivityType
in scheme: ateco-2007
narrower: https://w3id.org/italia/controlled-vocabulary/classifications-for-organizations/ateco-2007/791
broader: https://w3id.org/italia/controlled-vocabulary/classifications-for-organizations/ateco-2007/N
narrower: https://w3id.org/italia/controlled-vocabulary/classifications-for-organizations/ateco-2007/799
type: Concept
has rank order: 2
notation: 79
definition: Questa divisione include le attività delle agenzie principalmente impegnate nella vendita di pacchetti di viaggio, gite, servizi di trasporto e sistemazione per il pubblico e per clienti commerciali, le attività di organizzazione e gestione di gite turistiche proposte da agenzie di viaggio o da tour operator; la divisione comprende anche altri servizi quali i servizi di prenotazione. Sono incluse anche le attività delle guide turistiche e di promozione turistica.