Servizi di vigilanza privata
type: PrivateOrgActivityType
type: Concept
broader: https://w3id.org/italia/controlled-vocabulary/classifications-for-organizations/ateco-2007/801
notation: 80.10
has rank order: 4
narrower: https://w3id.org/italia/controlled-vocabulary/classifications-for-organizations/ateco-2007/80100
definition: Questa classe include l'erogazione di uno o pià¹ dei servizi seguenti: servizi di scorta e pattugliamento; trasporto valori tramite personale e attrezzature atte a salvaguardare i beni durante il trasporto.
in scheme: ateco-2007