SERVIZI DI VIGILANZA E INVESTIGAZIONE
type: PrivateOrgActivityType
notation: 80
has rank order: 2
narrower: https://w3id.org/italia/controlled-vocabulary/classifications-for-organizations/ateco-2007/803
narrower: https://w3id.org/italia/controlled-vocabulary/classifications-for-organizations/ateco-2007/802
definition: Questa divisione include i servizi legati alla sicurezza, quali: servizi di investigazione; servizi di scorta e pattugliamento; trasporto valori tramite personale e attrezzature atte a salvaguardare i beni durante il trasporto; gestione di sistemi di sicurezza e di allarme, sistemi elettronici quali allarmi antifurto e antincendio.
narrower: https://w3id.org/italia/controlled-vocabulary/classifications-for-organizations/ateco-2007/801
broader: https://w3id.org/italia/controlled-vocabulary/classifications-for-organizations/ateco-2007/N
type: Concept
in scheme: ateco-2007