Pulizia generale (non specializzata) di edifici
type: PrivateOrgActivityType
broader: https://w3id.org/italia/controlled-vocabulary/classifications-for-organizations/ateco-2007/812
notation: 81.21
has rank order: 4
narrower: https://w3id.org/italia/controlled-vocabulary/classifications-for-organizations/ateco-2007/81210
definition: Le attività incluse in questa classe interessano principalmente la pulizia di interni, sebbene possano includere la pulizia di aree esterne come ad esempio finestre o vialetti.
in scheme: ateco-2007
type: Concept