ATTIVITÀ DI PULIZIA E DISINFESTAZIONE
type: Concept
definition: Questo gruppo include i servizi di pulizia effettuati all'interno di immobili di ogni tipo, la pulizia esterna di edifici, la pulizia specializzata per edifici o altro, la pulizia di macchine industriali, la pulizia interna delle cisterne per trasporti su strada o marittimi, le attività di disinfezione e di disinfestazione di edifici e di macchinari industriali, la pulizia delle bottiglie, la pulizia delle strade, la rimozione di neve e ghiaccio.
has rank order: 3
broader: https://w3id.org/italia/controlled-vocabulary/classifications-for-organizations/ateco-2007/81
narrower: https://w3id.org/italia/controlled-vocabulary/classifications-for-organizations/ateco-2007/8122
narrower: https://w3id.org/italia/controlled-vocabulary/classifications-for-organizations/ateco-2007/8121
notation: 81.2
narrower: https://w3id.org/italia/controlled-vocabulary/classifications-for-organizations/ateco-2007/8129
in scheme: ateco-2007
type: PrivateOrgActivityType