SERVIZI DI SUPPORTO ALLE IMPRESE N.C.A.
type: PrivateOrgActivityType
notation: 82.9
broader: https://w3id.org/italia/controlled-vocabulary/classifications-for-organizations/ateco-2007/82
narrower: https://w3id.org/italia/controlled-vocabulary/classifications-for-organizations/ateco-2007/8292
has rank order: 3
type: Concept
in scheme: ateco-2007
narrower: https://w3id.org/italia/controlled-vocabulary/classifications-for-organizations/ateco-2007/8291
definition: Questo gruppo include le attività di recupero crediti svolte da agenzie specializzate e tutte quelle attività di supporto alle imprese non classificate altrove.
narrower: https://w3id.org/italia/controlled-vocabulary/classifications-for-organizations/ateco-2007/8299