Regolamentazione delle attività che contribuiscono ad una pià¹ efficiente gestione delle attività economiche
type: Concept
type: PrivateOrgActivityType
broader: https://w3id.org/italia/controlled-vocabulary/classifications-for-organizations/ateco-2007/841
definition: Questa classe include l'amministrazione pubblica e la regolamentazione di vari settori economici, inclusa l'allocazione di sussidi: agricoltura, utilizzazione del suolo, risorse energetiche e minerarie, infrastrutture, trasporti, comunicazioni, alberghi e turismo, commercio all'ingrosso e al dettaglio Include anche l'amministrazione delle politiche di ricerca e sviluppo e dei relativi fondi, volte a migliorare le prestazioni economiche
narrower: https://w3id.org/italia/controlled-vocabulary/classifications-for-organizations/ateco-2007/84135
narrower: https://w3id.org/italia/controlled-vocabulary/classifications-for-organizations/ateco-2007/84138
narrower: https://w3id.org/italia/controlled-vocabulary/classifications-for-organizations/ateco-2007/84131
narrower: https://w3id.org/italia/controlled-vocabulary/classifications-for-organizations/ateco-2007/84134
narrower: https://w3id.org/italia/controlled-vocabulary/classifications-for-organizations/ateco-2007/84137
narrower: https://w3id.org/italia/controlled-vocabulary/classifications-for-organizations/ateco-2007/84139
narrower: https://w3id.org/italia/controlled-vocabulary/classifications-for-organizations/ateco-2007/84136
narrower: https://w3id.org/italia/controlled-vocabulary/classifications-for-organizations/ateco-2007/84133
narrower: https://w3id.org/italia/controlled-vocabulary/classifications-for-organizations/ateco-2007/84132
in scheme: ateco-2007
has rank order: 4
notation: 84.13