Istruzione secondaria di formazione generale
type: PrivateOrgActivityType
notation: 85.31
narrower: https://w3id.org/italia/controlled-vocabulary/classifications-for-organizations/ateco-2007/85311
in scheme: ateco-2007
has rank order: 4
definition: Questa classe comprende un tipo di istruzione che pone le basi dell'apprendimento e dello sviluppo umano e che à¨ in grado di favorire nuove opportunità di istruzione futura. A questo livello, l'approfondimento degli argomenti inizia ad avere una certa influenza sull'esperienza formativa dello studente. I programmi sono progettati in modo da qualificare gli studenti per l'accesso ad un'istruzione sia tecnica, sia professionale, o per l'accesso a livelli superiore di istruzione che non richiedono una preparazione specifica.
narrower: https://w3id.org/italia/controlled-vocabulary/classifications-for-organizations/ateco-2007/85312
type: Concept
broader: https://w3id.org/italia/controlled-vocabulary/classifications-for-organizations/ateco-2007/853