ISTRUZIONE POST-SECONDARIA UNIVERSITARIA E NON UNIVERSITARIA
type: PrivateOrgActivityType
broader: https://w3id.org/italia/controlled-vocabulary/classifications-for-organizations/ateco-2007/85
narrower: https://w3id.org/italia/controlled-vocabulary/classifications-for-organizations/ateco-2007/8542
has rank order: 3
in scheme: ateco-2007
definition: Questo gruppo include l'erogazione di corsi di istruzione post-secondaria non universitaria e di corsi universitari per il conferimento dei titoli accademici di laurea, laurea specialistica e specializzazione post-laurea.
notation: 85.4
narrower: https://w3id.org/italia/controlled-vocabulary/classifications-for-organizations/ateco-2007/8541
type: Concept