Corsi sportivi e ricreativi
type: PrivateOrgActivityType
broader: https://w3id.org/italia/controlled-vocabulary/classifications-for-organizations/ateco-2007/855
notation: 85.51
has rank order: 4
narrower: https://w3id.org/italia/controlled-vocabulary/classifications-for-organizations/ateco-2007/85510
definition: Questa classe include i centri e le scuole che offrono corsi di preparazione per l'attività sportiva, a gruppi o singoli individui. Sono inclusi anche i centri che offrono corsi sportivi serali o diurni. Non sono incluse accademie ed università . I corsi possono avere luogo in contesti diversi, quali le strutture dell'unità o del cliente, le istituzioni scolastiche o tramite altri mezzi. Le attività comprese in questa classe sono organizzate in modo strutturato.
in scheme: ateco-2007
type: Concept