Formazione culturale
type: PrivateOrgActivityType
broader: https://w3id.org/italia/controlled-vocabulary/classifications-for-organizations/ateco-2007/855
notation: 85.52
has rank order: 4
narrower: https://w3id.org/italia/controlled-vocabulary/classifications-for-organizations/ateco-2007/85520
definition: Questa classe include i corsi di arte, recitazione e musica. Le unità preposte a questo tipo di istruzione possono essere denominate "scuole", "istituti", "studi" eccetera, forniscono istruzione formalmente organizzata, per scopi ricreativi o per sviluppo formativo personale, per hobby senza portare tuttavia al conseguimento di un diploma professionale, di una laurea o di una laurea specialistica.
in scheme: ateco-2007
type: Concept