ALTRI SERVIZI DI ISTRUZIONE
type: PrivateOrgActivityType
narrower: https://w3id.org/italia/controlled-vocabulary/classifications-for-organizations/ateco-2007/8559
in scheme: ateco-2007
notation: 85.5
definition: Questo gruppo include l'istruzione generale continua, istruzione professionale continua e la formazione per le varie professioni, per hobby o per lo sviluppo conoscitivo personale. Sono escluse le attività comprese nei gruppi 85.1-85.4 - istruzione prescolastica, istruzione primaria, istruzione secondaria ed istruzione superiore. Sono inclusi corsi di preparazione all'attività sportiva, corsi di lingua straniera, corsi di arte, recitazione o musica o altri corsi di formazione specialistici, non assimilabili alle attività di istruzione generale comprese nei gruppi 85.1-85.4
type: Concept
narrower: https://w3id.org/italia/controlled-vocabulary/classifications-for-organizations/ateco-2007/8553
broader: https://w3id.org/italia/controlled-vocabulary/classifications-for-organizations/ateco-2007/85
narrower: https://w3id.org/italia/controlled-vocabulary/classifications-for-organizations/ateco-2007/8552
has rank order: 3
narrower: https://w3id.org/italia/controlled-vocabulary/classifications-for-organizations/ateco-2007/8551