SERVIZI DEGLI STUDI MEDICI E ODONTOIATRICI
type: PrivateOrgActivityType
type: Concept
narrower: https://w3id.org/italia/controlled-vocabulary/classifications-for-organizations/ateco-2007/8621
narrower: https://w3id.org/italia/controlled-vocabulary/classifications-for-organizations/ateco-2007/8622
narrower: https://w3id.org/italia/controlled-vocabulary/classifications-for-organizations/ateco-2007/8623
broader: https://w3id.org/italia/controlled-vocabulary/classifications-for-organizations/ateco-2007/86
notation: 86.2
definition: Questo gruppo include le visite mediche ed i trattamenti effettuati da medici generici, specialisti, inclusi chirurghi, dentisti eccetera. Le attività previste in questo gruppo possono essere svolte in studi privati, in ambulatori in cui operano gruppi di medici ed in cliniche ospedaliere che svolgono servizio ambulatoriale presso aziende, scuole, case di riposo, organizzazioni sindacali, nonchà© a domicilio degli ammalati. Questo gruppo include anche: - servizi di consulto privato a pazienti ricoverati
in scheme: ateco-2007
has rank order: 3