SERVIZI DI ASSISTENZA SOCIALE RESIDENZIALE
type: Concept
narrower: https://w3id.org/italia/controlled-vocabulary/classifications-for-organizations/ateco-2007/872
narrower: https://w3id.org/italia/controlled-vocabulary/classifications-for-organizations/ateco-2007/871
has rank order: 2
in scheme: ateco-2007
definition: Questa divisione include l'erogazione di servizi residenziali di assistenza sanitaria associata a servizi infermieristici, di supervisione o di altro tipo, secondo le necessità dei residenti. Le strutture ricoprono un ruolo significativo nel processo di produzione e l'assistenza erogata consiste in un insieme di servizi sociali e sanitari, di cui questi ultimi si configurano quasi esclusivamente come servizi infermieristici.
narrower: https://w3id.org/italia/controlled-vocabulary/classifications-for-organizations/ateco-2007/879
broader: https://w3id.org/italia/controlled-vocabulary/classifications-for-organizations/ateco-2007/Q
notation: 87
narrower: https://w3id.org/italia/controlled-vocabulary/classifications-for-organizations/ateco-2007/873
type: PrivateOrgActivityType