ASSISTENZA SOCIALE NON RESIDENZIALE
type: Concept
in scheme: ateco-2007
narrower: https://w3id.org/italia/controlled-vocabulary/classifications-for-organizations/ateco-2007/889
notation: 88
definition: Le attività di questa divisione non includono servizi di alloggio.
narrower: https://w3id.org/italia/controlled-vocabulary/classifications-for-organizations/ateco-2007/881
type: PrivateOrgActivityType
broader: https://w3id.org/italia/controlled-vocabulary/classifications-for-organizations/ateco-2007/Q
has rank order: 2