ATTIVITÀ CREATIVE, ARTISTICHE E DI INTRATTENIMENTO
type: Concept
definition: Questa divisione include la gestione di strutture e l'erogazione di servizi destinati a soddisfare gli interessi culturali e di intrattenimento del pubblico. Sono incluse la produzione, la promozione e la partecipazione a spettacoli dal vivo, eventi o esibizioni destinati al pubblico; fornitura di competenze artistiche, creative o tecniche per produzioni artistiche o spettacoli dal vivo.
in scheme: ateco-2007
notation: 90
type: PrivateOrgActivityType
narrower: https://w3id.org/italia/controlled-vocabulary/classifications-for-organizations/ateco-2007/900
broader: https://w3id.org/italia/controlled-vocabulary/classifications-for-organizations/ateco-2007/R
has rank order: 2