ATTIVITÀ CREATIVE, ARTISTICHE E DI INTRATTENIMENTO
type: Concept
type: PrivateOrgActivityType
broader: R
definition: Questa divisione include la gestione di strutture e l'erogazione di servizi destinati a soddisfare gli interessi culturali e di intrattenimento del pubblico. Sono incluse la produzione, la promozione e la partecipazione a spettacoli dal vivo, eventi o esibizioni destinati al pubblico; fornitura di competenze artistiche, creative o tecniche per produzioni artistiche o spettacoli dal vivo.
in scheme: ateco-2007
narrower: 900
notation: 90
has rank order: 2