ATTIVITÀ RIGUARDANTI LE LOTTERIE, LE SCOMMESSE, LE CASE DA GIOCO
type: PrivateOrgActivityType
broader: https://w3id.org/italia/controlled-vocabulary/classifications-for-organizations/ateco-2007/R
notation: 92
has rank order: 2
narrower: https://w3id.org/italia/controlled-vocabulary/classifications-for-organizations/ateco-2007/920
definition: Questa divisione include la gestione di strutture per gioco e scommesse come i casinà², le sale bingo, le sale per videogiochi e la fornitura di servizi connessi come lotterie e scommesse per corse.
in scheme: ateco-2007
type: Concept