Attività di club sportivi
type: PrivateOrgActivityType
type: Concept
broader: 931
definition: Questa classe include le attività svolte a livello professionistico, semi-professionistico o dilettantistico, che offrono ai propri membri la possibilità di partecipare a gare sportive.
in scheme: ateco-2007
narrower: 93120
notation: 93.12
has rank order: 4