Altre attività ricreative e di divertimento
type: PrivateOrgActivityType
type: Concept
in scheme: ateco-2007
narrower: https://w3id.org/italia/controlled-vocabulary/classifications-for-organizations/ateco-2007/93299
narrower: https://w3id.org/italia/controlled-vocabulary/classifications-for-organizations/ateco-2007/93293
narrower: https://w3id.org/italia/controlled-vocabulary/classifications-for-organizations/ateco-2007/93291
narrower: https://w3id.org/italia/controlled-vocabulary/classifications-for-organizations/ateco-2007/93292
broader: https://w3id.org/italia/controlled-vocabulary/classifications-for-organizations/ateco-2007/932
notation: 93.29
definition: Questa classe include le attività ricreative (esclusi i parchi di divertimento e i parchi tematici) non classificate altrove.
has rank order: 4