ATTIVITÀ RICREATIVE E DI DIVERTIMENTO
type: Concept
notation: 93.2
in scheme: ateco-2007
narrower: https://w3id.org/italia/controlled-vocabulary/classifications-for-organizations/ateco-2007/9329
has rank order: 3
type: PrivateOrgActivityType
narrower: https://w3id.org/italia/controlled-vocabulary/classifications-for-organizations/ateco-2007/9321
definition: Questo gruppo include un'ampia gamma di unità che gestiscono strutture o forniscono servizi mirati a soddisfare diversi interessi. àˆ inclusa la gestione di varie attrazioni quali giostre meccaniche, giochi d'acqua, giochi, spettacoli, esibizioni a tema e aree da picnic.
broader: https://w3id.org/italia/controlled-vocabulary/classifications-for-organizations/ateco-2007/93