ATTIVITÀ DI ALTRE ORGANIZZAZIONI ASSOCIATIVE
type: PrivateOrgActivityType
has rank order: 3
narrower: https://w3id.org/italia/controlled-vocabulary/classifications-for-organizations/ateco-2007/9499
broader: https://w3id.org/italia/controlled-vocabulary/classifications-for-organizations/ateco-2007/94
in scheme: ateco-2007
notation: 94.9
narrower: https://w3id.org/italia/controlled-vocabulary/classifications-for-organizations/ateco-2007/9492
definition: Questo gruppo include le attività delle organizzazioni (escluse le organizzazioni economiche e dei datori di lavoro, le associazioni professionali, i sindacati) che promuovono gli interessi dei propri membri.
narrower: https://w3id.org/italia/controlled-vocabulary/classifications-for-organizations/ateco-2007/9491
type: Concept