RIPARAZIONE DI COMPUTER E DI APPARECCHIATURE PER LE COMUNICAZIONI
type: Concept
notation: 95.1
definition: Questo gruppo include la riparazione e la manutenzione di computer, periferiche ed apparecchiature per le comunicazioni.
type: PrivateOrgActivityType
narrower: https://w3id.org/italia/controlled-vocabulary/classifications-for-organizations/ateco-2007/9512
broader: https://w3id.org/italia/controlled-vocabulary/classifications-for-organizations/ateco-2007/95
narrower: https://w3id.org/italia/controlled-vocabulary/classifications-for-organizations/ateco-2007/9511
in scheme: ateco-2007
has rank order: 3