RIPARAZIONE DI COMPUTER E DI APPARECCHIATURE PER LE COMUNICAZIONI
type: Concept
type: PrivateOrgActivityType
broader: 95
definition: Questo gruppo include la riparazione e la manutenzione di computer, periferiche ed apparecchiature per le comunicazioni.
in scheme: ateco-2007
narrower: 9512
narrower: 9511
notation: 95.1
has rank order: 3