ALTRE ATTIVITÀ DI SERVIZI PER LA PERSONA
type: PrivateOrgActivityType
broader: https://w3id.org/italia/controlled-vocabulary/classifications-for-organizations/ateco-2007/S
notation: 96
has rank order: 2
narrower: https://w3id.org/italia/controlled-vocabulary/classifications-for-organizations/ateco-2007/960
definition: Questa divisione include tutti i servizi non altrove menzionati nella classificazione. In particolare, sono inclusi i servizi di lavanderia e pulitura (a secco) di articoli tessili e in pelliccia, i servizi degli acconciatori ed altri trattamenti estetici, i servizi di pompe funebri e le attività connesse.
in scheme: ateco-2007
type: Concept