Attività di famiglie e convivenze come datori di lavoro per personale domestico
type: PrivateOrgActivityType
type: Concept
broader: https://w3id.org/italia/controlled-vocabulary/classifications-for-organizations/ateco-2007/970
notation: 97.00
has rank order: 4
narrower: https://w3id.org/italia/controlled-vocabulary/classifications-for-organizations/ateco-2007/97000
definition: Questa classe include le attività di famiglie e convivenze (compresi i condomini) come datori di lavoro per personale domestico quale collaboratori domestici, cuochi, camerieri, guardarobieri, maggiordomi, lavandaie, giardinieri, portinai, stallieri, autisti, custodi, governanti, baby-sitter, istitutori, segretari eccetera. Il personale domestico impiegato puà² dichiarare l'attività del datore di lavoro in censimenti o studi, anche quando il datore di lavoro à¨ un singolo individuo. Il prodotto di questa attività à¨ consumato in proprio dalla famiglia.
in scheme: ateco-2007