ESTRAZIONE DI MINERALI DA CAVE E MINIERE
type: PrivateOrgActivityType
type: Concept
narrower: https://w3id.org/italia/controlled-vocabulary/classifications-for-organizations/ateco-2007/07
narrower: https://w3id.org/italia/controlled-vocabulary/classifications-for-organizations/ateco-2007/05
narrower: https://w3id.org/italia/controlled-vocabulary/classifications-for-organizations/ateco-2007/08
narrower: https://w3id.org/italia/controlled-vocabulary/classifications-for-organizations/ateco-2007/09
narrower: https://w3id.org/italia/controlled-vocabulary/classifications-for-organizations/ateco-2007/06
has rank order: 1
in scheme: ateco-2007
notation: B
definition: L'estrazione da cave e miniere include l'estrazione dei minerali che si presentano in natura allo stato solido (carbone e minerali), liquido (petrolio) o gassoso (gas naturale). L'estrazione puà² essere effettuata utilizzando diversi metodi, quali l'impiego di miniere sotterranee o a cielo aperto, di pozzi, estrazioni marine eccetera. Questa sezione include attività supplementari mirate alla preparazione dei materiali grezzi per la commercializzazione, per esempio, la frantumazione, la macinazione, il lavaggio, l'essiccazione, la cernita, la concentrazione di minerali, la liquefazione del gas naturale e l'agglomerazione dei combustibili solidi. Queste operazioni vengono spesso effettuate dalle unità che hanno estratto le risorse e/o da altre unità situate in prossimità delle stesse. Le attività estrattive sono classificate in divisioni, gruppi e classi in base al principale minerale prodotto. Le divisioni 05, 06 riguardano l'estrazione di combustibili fossili (carbone, lignite, petrolio, gas); le divisioni 07, 08 riguardano i minerali metalliferi, minerali vari e prodotti di cava. Alcune operazioni tecniche di questa sezione, in particolare legate all'estrazione di idrocarburi, possono anche essere effettuate da unità specializzate per conto terzi, come i servizi industriali che rientrano nella divisione 09.