ATTIVITÀ MANIFATTURIERE
type: PrivateOrgActivityType
type: Concept
narrower: https://w3id.org/italia/controlled-vocabulary/classifications-for-organizations/ateco-2007/12
narrower: https://w3id.org/italia/controlled-vocabulary/classifications-for-organizations/ateco-2007/15
narrower: https://w3id.org/italia/controlled-vocabulary/classifications-for-organizations/ateco-2007/22
narrower: https://w3id.org/italia/controlled-vocabulary/classifications-for-organizations/ateco-2007/28
narrower: https://w3id.org/italia/controlled-vocabulary/classifications-for-organizations/ateco-2007/18
narrower: https://w3id.org/italia/controlled-vocabulary/classifications-for-organizations/ateco-2007/20
narrower: https://w3id.org/italia/controlled-vocabulary/classifications-for-organizations/ateco-2007/32
narrower: https://w3id.org/italia/controlled-vocabulary/classifications-for-organizations/ateco-2007/10
narrower: https://w3id.org/italia/controlled-vocabulary/classifications-for-organizations/ateco-2007/16
narrower: https://w3id.org/italia/controlled-vocabulary/classifications-for-organizations/ateco-2007/13
narrower: https://w3id.org/italia/controlled-vocabulary/classifications-for-organizations/ateco-2007/25
narrower: https://w3id.org/italia/controlled-vocabulary/classifications-for-organizations/ateco-2007/23
narrower: https://w3id.org/italia/controlled-vocabulary/classifications-for-organizations/ateco-2007/30
narrower: https://w3id.org/italia/controlled-vocabulary/classifications-for-organizations/ateco-2007/19
narrower: https://w3id.org/italia/controlled-vocabulary/classifications-for-organizations/ateco-2007/11
narrower: https://w3id.org/italia/controlled-vocabulary/classifications-for-organizations/ateco-2007/26
narrower: https://w3id.org/italia/controlled-vocabulary/classifications-for-organizations/ateco-2007/33
narrower: https://w3id.org/italia/controlled-vocabulary/classifications-for-organizations/ateco-2007/17
narrower: https://w3id.org/italia/controlled-vocabulary/classifications-for-organizations/ateco-2007/29
narrower: https://w3id.org/italia/controlled-vocabulary/classifications-for-organizations/ateco-2007/24
narrower: https://w3id.org/italia/controlled-vocabulary/classifications-for-organizations/ateco-2007/31
narrower: https://w3id.org/italia/controlled-vocabulary/classifications-for-organizations/ateco-2007/14
narrower: https://w3id.org/italia/controlled-vocabulary/classifications-for-organizations/ateco-2007/21
narrower: https://w3id.org/italia/controlled-vocabulary/classifications-for-organizations/ateco-2007/27
note: Nota: I confini del settore manifatturiero e degli altri settori del sistema di classificazione sono talvolta indistinti. Come regola generale, le attività della sezione manifattura implicano la trasformazione di materiali in nuovi prodotti. Il loro output à¨ un prodotto nuovo. Tuttavia il confine tra cià² che puà² essere considerato o meno un prodotto nuovo puà² avere aree di incertezza. Ai fini di una classificazione univoca, la Nace risolve in un senso o nell'altro i diversi casi, considerando, ad esempio, come attività manifatturiere le seguenti attività : - Lavorazione del pesce fresco (sgusciatura delle ostriche, filettatura del pesce), non effettuate su un peschereccio (cfr. 10.20) - Pastorizzazione ed imbottigliamento del latte (cfr. 10.51) - Trasformazione del cuoio (cfr. 15.11) - Conservazione del legno (cfr. 16.10) - Stampa ed attività connesse (cfr. 18.1) - Rigenerazione di pneumatici (cfr. 22.11) - Produzione di calcestruzzo pronto all'uso (cfr. 23.63) - Galvanostegia, placcatura, trattamento termico dei metalli e lucidatura (cfr. 25.61) - Ricostruzione o rifabbricazione di macchine (ad esempio motori per autoveicoli, cfr. 29.10)
has rank order: 1
in scheme: ateco-2007
definition: Questa sezione include la trasformazione fisica o chimica di materiali, sostanze o componenti in nuovi prodotti, sebbene questo non sia l'unico criterio con cui à¨ possibile definire queste attività (cfr. nota sul riciclaggio dei materiali di scarto). I materiali, le sostanze o i componenti trasformati sono materie prime che provengono dall'agricoltura, dalla silvicoltura, dalla pesca, dall'estrazione di minerali oppure sono il prodotto di altre attività manifatturiere. L'alterazione, la rigenerazione o la ricostruzione sostanziale dei prodotti sono in genere considerate attività manifatturiere. Le attività manifatturiere spesso sono effettuate in stabilimenti, fabbriche od opifici che utilizzano macchine a motore e apparecchiature di movimentazione dei materiali. Rientrano in questa sezione anche le unità che trasformano manualmente materiali e sostanze in nuovi prodotti, quelle che effettuano la manifattura nell'abitazione del lavoratore e le unità che vendono al pubblico prodotti fabbricati nei medesimi locali in cui avviene la vendita, quali panetterie e sartorie di abiti su misura. Le unità manifatturiere possono: - lavorare direttamente i materiali - subappaltare una parte della lavorazione dei materiali - subappaltare l'intera lavorazione dei materiali propri e non, mantenendo la proprietà legale ed i brevetti del prodotto - portare a termine le lavorazioni subappaltate menzionate sopra. Il nuovo prodotto trasformato puà² essere finito, ossia pronto per l'utilizzo o il consumo, oppure puà² trattarsi di un prodotto semilavorato destinato ad un'ulteriore attività manifatturiera. Ad esempio il prodotto di una raffineria di allumina viene utilizzato per la produzione di alluminio di base, l'alluminio primario viene utilizzato negli impianti di trafilatura per fili di alluminio e i fili di alluminio sono utilizzati per la fabbricazione di prodotti fatti con fili di alluminio. La produzione di componenti e parti specialistiche, nonchà© di accessori, di macchinari e…
notation: C