FORNITURA DI ENERGIA ELETTRICA, GAS, VAPORE E ARIA CONDIZIONATA
type: PrivateOrgActivityType
type: Concept
notation: D
has rank order: 1
narrower: https://w3id.org/italia/controlled-vocabulary/classifications-for-organizations/ateco-2007/35
definition: Questa sezione include l'attività di fornitura di energia elettrica, gas naturale, vapore, acqua calda e simili attraverso una infrastruttura permanente (rete) con linee, tubature o condotte. L'estensione della rete non à¨ determinante; à¨ inclusa anche la distribuzione di elettricità , gas, vapore, acqua calda e simili in complessi industriali e edifici residenziali. Questa sezione include pertanto la gestione di aziende elettriche e del gas, che generano, controllano e distribuiscono energia elettrica o gas. àˆ inoltre inclusa l'erogazione di vapore e la fornitura di aria condizionata.
in scheme: ateco-2007