COSTRUZIONI
type: PrivateOrgActivityType
in scheme: ateco-2007
definition: Questa sezione comprende l'attività generica e specializzata per la costruzione di edifici e di opere di ingegneria civile. Essa include i nuovi lavori, le riparazioni, le aggiunte, le alterazioni, l'installazione nei cantieri di edifici prefabbricati o di strutture e le costruzioni di natura temporanea. I lavori di costruzione generali riguardano la costruzione di complessi abitativi, fabbricati per uffici, negozi, ed altri edifici pubblici e di servizio, fabbricati rurali eccetera, nonchà© la costruzione di opere del genio civile come autostrade, strade, ponti, gallerie, ferrovie, campi di aviazione, porti e altre opere idrauliche, la costruzione di sistemi di irrigazione e di fognatura, impianti industriali, condotte e linee elettriche, impianti sportivi eccetera. Questi lavori possono essere eseguiti in conto proprio o per conto terzi. Parte dei lavori o il loro complesso possono essere effettuati in subappalto. Sono classificate in questa divisione anche le unità responsabili di un progetto di costruzione nella sua globalità . Sono incluse anche le attività di riparazione di edifici e le opere di ingegneria. Questa sezione include la costruzione di edifici nel loro complesso (divisione 41), le opere di ingegneria civile (divisione 42), nonchà© i lavori di costruzione specializzati (divisione 43). Il noleggio di attrezzature con manovratore per costruzioni à¨ classificato fra i lavori di costruzione specializzati effettuati con tali attrezzature. Questa sezione comprende anche lo sviluppo di progetti per la costruzione di edifici o di opere di ingegneria civile attraverso il reperimento di mezzi finanziari, tecnici e fisici al fine di realizzare unità immobiliari. Se tali attività non sono finalizzate alla successiva vendita dei manufatti costruiti (o dei progetti realizzati), bensà¬ al loro impiego, l'unità non deve essere classificata in questa sezione, ma in base al tipo di categoria di utilizzo, ossia attività immobiliari, manifatturiero eccetera. In questa …
narrower: https://w3id.org/italia/controlled-vocabulary/classifications-for-organizations/ateco-2007/42
narrower: https://w3id.org/italia/controlled-vocabulary/classifications-for-organizations/ateco-2007/43
notation: F
has rank order: 1
type: Concept
narrower: https://w3id.org/italia/controlled-vocabulary/classifications-for-organizations/ateco-2007/41