COMMERCIO ALL'INGROSSO E AL DETTAGLIO; RIPARAZIONE DI AUTOVEICOLI E MOTOCICLI
type: PrivateOrgActivityType
narrower: https://w3id.org/italia/controlled-vocabulary/classifications-for-organizations/ateco-2007/47
in scheme: ateco-2007
narrower: https://w3id.org/italia/controlled-vocabulary/classifications-for-organizations/ateco-2007/45
notation: G
has rank order: 1
definition: In questa sezione vengono classificate le attività di vendita all'ingrosso e al dettaglio (ossia vendita senza trasformazione) di ogni genere di beni, nonchà© la fornitura di servizi correlati alla vendita di merci. La vendita all'ingrosso e quella al dettaglio costituiscono le fasi finali della catena di distribuzione di merci. Sono incluse in questa sezione anche la riparazione di autoveicoli e di motocicli. La vendita senza trasformazione comprende le operazioni di movimentazione delle merci abitualmente connesse all'attività di commercio, ad esempio la suddivisione, il riordinamento e il raggruppamento di merci, la miscelatura di merci (ad esempio vino o sabbia), l'imbottigliamento (preceduto o meno dalla pulitura delle bottiglie), l'imballaggio, la suddivisione di grosse partite di merci e il reimballaggio per la distribuzione in partite pià¹ piccole, l'immagazzinaggio (con o senza congelamento o refrigerazione), la pulitura e l'essiccazione di prodotti agricoli, il taglio di pannelli di fibre o di lamine metalliche come attività connesse. La divisione 45 include tutte le attività legate al commercio e alla riparazione di autoveicoli e di motocicli, mentre le divisioni 46 e 47 includono tutte le altre attività commerciali. La distinzione tra la divisione 46 (Commercio all'ingrosso) e la divisione 47 (Commercio al dettaglio) si basa sulla tipologia di clientela predominante. La vendita all'ingrosso (senza trasformazione) riguarda, beni nuovi ed usati ceduti a dettaglianti, ad utilizzatori industriali, commerciali, istituzionali o professionali, ad altri grossisti, oppure ad operatori che comperano e vendono merci a tali persone o società . Essa viene effettuata da grossisti titolari delle merci commercializzate, da distributori industriali, esportatori, importatori, cooperative d'acquisto, concessionari di vendita e uffici di vendita (ma non negozi al dettaglio), tenuti da unità manifatturiere o estrattive separate dagli impianti di produzione, mirate alla vendi…
type: Concept
narrower: https://w3id.org/italia/controlled-vocabulary/classifications-for-organizations/ateco-2007/46