TRASPORTO E MAGAZZINAGGIO
type: PrivateOrgActivityType
type: Concept
definition: In questa sezione sono comprese le attività di trasporto di passeggeri o merci effettuate su base regolare o meno per ferrovia, mediante condotte, su strada, per via d'acqua o aereo e le attività ausiliarie quali servizi ai terminal, parcheggi, centri di movimentazione e di magazzinaggio di merci eccetera, l'attività di noleggio di mezzi di trasporto con autista od operatore. Sono anche incluse le attività postali ed i servizi di corriere. Sono inclusi anche i trasporti di passeggeri a fini ricreativi. Questa sezione include i servizi di ristorazione e bar effettuati dalle stesse imprese che effettuano il trasporto.
in scheme: ateco-2007
narrower: 53
narrower: 50
narrower: 51
narrower: 52
narrower: 49
notation: H
has rank order: 1