ATTIVITÀ DEI SERVIZI DI ALLOGGIO E DI RISTORAZIONE
type: PrivateOrgActivityType
notation: I
has rank order: 1
narrower: https://w3id.org/italia/controlled-vocabulary/classifications-for-organizations/ateco-2007/56
narrower: https://w3id.org/italia/controlled-vocabulary/classifications-for-organizations/ateco-2007/55
definition: In questa sezione sono incluse le strutture che forniscono alloggio per brevi periodi a visitatori e viaggiatori, nonchà© pasti e bevande pronti per il consumo. La quantità e i tipi di servizi complementari forniti dalle strutture di questa sezione possono variare ampiamente. Questa sezione esclude la fornitura di alloggio per lunghi periodi, che viene classificata nelle Attività Immobiliari (sezione L). Inoltre, à¨ esclusa la preparazione di alimenti o bevande non pronte per il consumo immediato o vendute tramite canali di distribuzione indipendenti, ovvero tramite attività di commercio all'ingrosso o al dettaglio. La preparazione di questo tipo di alimenti à¨ classificata nelle Attività manifatturiere (sezione C).
in scheme: ateco-2007
type: Concept