ATTIVITÀ FINANZIARIE E ASSICURATIVE
type: PrivateOrgActivityType
type: Concept
definition: Questa sezione include le attività di intermediazione finanziaria, incluse le assicurazioni, le riassicurazioni e i fondi pensione, nonchà© le attività ausiliarie dell'intermediazione finanziaria. Sono incluse anche le attività di assunzione e detenzione di attività finanziarie, quali l'attività delle holding, delle società fiduciarie, delle società di gestione dei fondi ed altri intermediari finanziari.
notation: K
narrower: https://w3id.org/italia/controlled-vocabulary/classifications-for-organizations/ateco-2007/65
narrower: https://w3id.org/italia/controlled-vocabulary/classifications-for-organizations/ateco-2007/64
narrower: https://w3id.org/italia/controlled-vocabulary/classifications-for-organizations/ateco-2007/66
has rank order: 1
in scheme: ateco-2007