ATTIVITÀ IMMOBILIARI
type: PrivateOrgActivityType
type: Concept
definition: Questa sezione include le attività di locatori, agenti e/o mediatori che operano nell'ambito di uno o pià¹ dei seguenti settori: vendita e acquisto di immobili, affitto di immobili, fornitura di altri servizi immobiliari quali la valutazione di immobili o le attività di agenti immobiliari per conto terzi. Le attività incluse in questa sezione possono essere effettuate su beni immobili propri o in affitto ed anche per conto terzi. Questa sezione include anche gli amministratori di beni immobili.
in scheme: ateco-2007
narrower: 68
notation: L
has rank order: 1