NOLEGGIO, AGENZIE DI VIAGGIO, SERVIZI DI SUPPORTO ALLE IMPRESE
type: Concept
notation: N
narrower: https://w3id.org/italia/controlled-vocabulary/classifications-for-organizations/ateco-2007/77
in scheme: ateco-2007
narrower: https://w3id.org/italia/controlled-vocabulary/classifications-for-organizations/ateco-2007/78
narrower: https://w3id.org/italia/controlled-vocabulary/classifications-for-organizations/ateco-2007/82
narrower: https://w3id.org/italia/controlled-vocabulary/classifications-for-organizations/ateco-2007/80
narrower: https://w3id.org/italia/controlled-vocabulary/classifications-for-organizations/ateco-2007/81
has rank order: 1
type: PrivateOrgActivityType
definition: Le attività previste in questa sezione possono essere svolte non solo a favore di imprese e/o istituzioni, ma anche a favore di utenti finali. Queste attività differiscono da quelle incluse nella sezione M, in quanto il loro scopo primario non consiste nel trasferimento di conoscenze specialistiche.
narrower: https://w3id.org/italia/controlled-vocabulary/classifications-for-organizations/ateco-2007/79