ISTRUZIONE
type: PrivateOrgActivityType
type: Concept
notation: P
has rank order: 1
narrower: https://w3id.org/italia/controlled-vocabulary/classifications-for-organizations/ateco-2007/85
definition: In questa sezione viene classificata l'istruzione a qualsiasi livello o per qualsiasi professione. L'attività puà² essere svolta attraverso lezioni orali o scritte, tramite radio, televisione, internet o per corrispondenza. La sezione include sia l'istruzione impartita dai vari istituti appartenenti al sistema scolastico nazionale ai suoi vari livelli, sia l'istruzione per adulti, i programmi contro l'analfabetismo eccetera. Sono inoltre incluse le scuole e le accademie militari, le scuole all'interno degli istituti penali eccetera ai rispettivi livelli. La sezione comprende sia l'istruzione pubblica che quella privata. Per ciascun livello d'istruzione iniziale le classi comprendono l'istruzione speciale rivolta agli alunni con disabilità fisica o mentale. La sezione à¨ articolata in base al livello di istruzione offerto, secondo quanto stabilito dai livelli ISCED 1997. Le attività delle istituzioni scolastiche che svolgono corsi al livello 0 ISCED vengono classificate nella classe 85.10, al livello 1 ISCED nella classe 85.20, ai livelli 2 e 3 ISCED nel gruppo 85.3, al livello 4 ISCED nella classe 85.41, ed ai livelli 5 e 6 ISCED nella classe 85.42. Questa sezione include anche l'istruzione impartita a scopi principalmente sportivi o ricreativi, ad esempio l'insegnamento del tennis o del golf e le attività di supporto all'istruzione.
in scheme: ateco-2007